Dublin Core Metadata Element Set, Version 1.1
type: Ontology
Date Modified: 2012-06-14
Date Created: 2015-06-19
comment: The data.gov.au Dataset Ontology is an OWL ontology designed to describe the characteristics of datasets published on data.gov.au. The ontology contains elements which describe the publication, update, origin, governance, spatial and temporal coverage and other contextual information about the dataset. The ontology also covers aspects of organisational custodianship and governance. By using this ontology to describe datasets on data.gov.au publishers increase discoverability and enable the consumption of this information in other applications/systems as Linked Data. It further enables decentralised publishing of catalogs and facilitates federated dataset search across sites, e.g. in datasets that are published by the States. Other publishers of Linked Data may make assertions about data published using this ontology, e.g. they may publish information about the use of the dataset in other applications.
publisher: DCMI
imports: geosparql
imports: time
imports: ns#
imports: dcat
imports: prov-o
prior version: government.ttl

Contributor
issued: 1999-07-02
Date Modified: 2008-01-14
note: A second property with the same name as this property has been declared in the dcterms: namespace (http://purl.org/dc/terms/). See the Introduction to the document "DCMI Metadata Terms" (http://dublincore.org/documents/dcmi-terms/) for an explanation.
comment: An entity responsible for making contributions to the resource.
description: Examples of a Contributor include a person, an organization, or a service. Typically, the name of a Contributor should be used to indicate the entity.
Has Version: contributor-006

Coverage
issued: 1999-07-02
Date Modified: 2008-01-14
note: A second property with the same name as this property has been declared in the dcterms: namespace (http://purl.org/dc/terms/). See the Introduction to the document "DCMI Metadata Terms" (http://dublincore.org/documents/dcmi-terms/) for an explanation.
description: Spatial topic and spatial applicability may be a named place or a location specified by its geographic coordinates. Temporal topic may be a named period, date, or date range. A jurisdiction may be a named administrative entity or a geographic place to which the resource applies. Recommended best practice is to use a controlled vocabulary such as the Thesaurus of Geographic Names [TGN]. Where appropriate, named places or time periods can be used in preference to numeric identifiers such as sets of coordinates or date ranges.
comment: The spatial or temporal topic of the resource, the spatial applicability of the resource, or the jurisdiction under which the resource is relevant.
Has Version: coverage-006

Creator
issued: 1999-07-02
Date Modified: 2008-01-14
note: A second property with the same name as this property has been declared in the dcterms: namespace (http://purl.org/dc/terms/). See the Introduction to the document "DCMI Metadata Terms" (http://dublincore.org/documents/dcmi-terms/) for an explanation.
comment: An entity primarily responsible for making the resource.
description: Examples of a Creator include a person, an organization, or a service. Typically, the name of a Creator should be used to indicate the entity.
Has Version: creator-006

Date
issued: 1999-07-02
Date Modified: 2008-01-14
comment: A point or period of time associated with an event in the lifecycle of the resource.
note: A second property with the same name as this property has been declared in the dcterms: namespace (http://purl.org/dc/terms/). See the Introduction to the document "DCMI Metadata Terms" (http://dublincore.org/documents/dcmi-terms/) for an explanation.
description: Date may be used to express temporal information at any level of granularity. Recommended best practice is to use an encoding scheme, such as the W3CDTF profile of ISO 8601 [W3CDTF].
Has Version: date-006

Description
issued: 1999-07-02
Date Modified: 2008-01-14
note: A second property with the same name as this property has been declared in the dcterms: namespace (http://purl.org/dc/terms/). See the Introduction to the document "DCMI Metadata Terms" (http://dublincore.org/documents/dcmi-terms/) for an explanation.
comment: An account of the resource.
description: Description may include but is not limited to: an abstract, a table of contents, a graphical representation, or a free-text account of the resource.
Has Version: description-006

Format
issued: 1999-07-02
Date Modified: 2008-01-14
note: A second property with the same name as this property has been declared in the dcterms: namespace (http://purl.org/dc/terms/). See the Introduction to the document "DCMI Metadata Terms" (http://dublincore.org/documents/dcmi-terms/) for an explanation.
description: Examples of dimensions include size and duration. Recommended best practice is to use a controlled vocabulary such as the list of Internet Media Types [MIME].
comment: The file format, physical medium, or dimensions of the resource.
Has Version: format-007

Identifier
issued: 1999-07-02
Date Modified: 2008-01-14
note: A second property with the same name as this property has been declared in the dcterms: namespace (http://purl.org/dc/terms/). See the Introduction to the document "DCMI Metadata Terms" (http://dublincore.org/documents/dcmi-terms/) for an explanation.
comment: An unambiguous reference to the resource within a given context.
description: Recommended best practice is to identify the resource by means of a string conforming to a formal identification system.
Has Version: identifier-006

Language
issued: 1999-07-02
Date Modified: 2008-01-14
comment: A language of the resource.
note: A second property with the same name as this property has been declared in the dcterms: namespace (http://purl.org/dc/terms/). See the Introduction to the document "DCMI Metadata Terms" (http://dublincore.org/documents/dcmi-terms/) for an explanation.
description: Recommended best practice is to use a controlled vocabulary such as RFC 4646 [RFC4646].
Has Version: language-007

Publisher
issued: 1999-07-02
Date Modified: 2008-01-14
note: A second property with the same name as this property has been declared in the dcterms: namespace (http://purl.org/dc/terms/). See the Introduction to the document "DCMI Metadata Terms" (http://dublincore.org/documents/dcmi-terms/) for an explanation.
comment: An entity responsible for making the resource available.
description: Examples of a Publisher include a person, an organization, or a service. Typically, the name of a Publisher should be used to indicate the entity.
Has Version: publisher-006

Relation
issued: 1999-07-02
Date Modified: 2008-01-14
comment: A related resource.
note: A second property with the same name as this property has been declared in the dcterms: namespace (http://purl.org/dc/terms/). See the Introduction to the document "DCMI Metadata Terms" (http://dublincore.org/documents/dcmi-terms/) for an explanation.
description: Recommended best practice is to identify the related resource by means of a string conforming to a formal identification system.
Has Version: relation-006

Rights
issued: 1999-07-02
Date Modified: 2008-01-14
note: A second property with the same name as this property has been declared in the dcterms: namespace (http://purl.org/dc/terms/). See the Introduction to the document "DCMI Metadata Terms" (http://dublincore.org/documents/dcmi-terms/) for an explanation.
comment: Information about rights held in and over the resource.
description: Typically, rights information includes a statement about various property rights associated with the resource, including intellectual property rights.
Has Version: rights-006

Source
issued: 1999-07-02
Date Modified: 2008-01-14
comment: A related resource from which the described resource is derived.
note: A second property with the same name as this property has been declared in the dcterms: namespace (http://purl.org/dc/terms/). See the Introduction to the document "DCMI Metadata Terms" (http://dublincore.org/documents/dcmi-terms/) for an explanation.
description: The described resource may be derived from the related resource in whole or in part. Recommended best practice is to identify the related resource by means of a string conforming to a formal identification system.
Has Version: source-006

Subject
issued: 1999-07-02
Date Modified: 2012-06-14
note: A second property with the same name as this property has been declared in the dcterms: namespace (http://purl.org/dc/terms/). See the Introduction to the document "DCMI Metadata Terms" (http://dublincore.org/documents/dcmi-terms/) for an explanation.
comment: The topic of the resource.
description: Typically, the subject will be represented using keywords, key phrases, or classification codes. Recommended best practice is to use a controlled vocabulary.
Has Version: subject-007

Title
issued: 1999-07-02
Date Modified: 2008-01-14
comment: A name given to the resource.
note: A second property with the same name as this property has been declared in the dcterms: namespace (http://purl.org/dc/terms/). See the Introduction to the document "DCMI Metadata Terms" (http://dublincore.org/documents/dcmi-terms/) for an explanation.
Has Version: title-006

Type
issued: 1999-07-02
Date Modified: 2008-01-14
note: A second property with the same name as this property has been declared in the dcterms: namespace (http://purl.org/dc/terms/). See the Introduction to the document "DCMI Metadata Terms" (http://dublincore.org/documents/dcmi-terms/) for an explanation.
description: Recommended best practice is to use a controlled vocabulary such as the DCMI Type Vocabulary [DCMITYPE]. To describe the file format, physical medium, or dimensions of the resource, use the Format element.
comment: The nature or genre of the resource.
Has Version: type-006

Abstract
type: AnnotationProperty
sub property of: Description
type: NamedIndividual
issued: 2000-07-11
Date Modified: 2008-01-14
comment: A summary of the resource.
Has Version: abstract-003

Access Rights
type: AnnotationProperty
sub property of: Rights
type: ObjectProperty
range: Rights Statement
type: NamedIndividual
issued: 2003-02-15
Date Modified: 2008-01-14
description: Access Rights may include information regarding access or restrictions based on privacy, security, or other policies.
comment: Information about who can access the resource or an indication of its security status.
Has Version: accessRights-002

Alternative Title
type: AnnotationProperty
sub property of: Title
type: DatatypeProperty
range: Literal
type: NamedIndividual
issued: 2000-07-11
Date Modified: 2010-10-11
comment: An alternative name for the resource.
description: The distinction between titles and alternative titles is application-specific.
Has Version: alternative-003

Date Available
type: AnnotationProperty
sub property of: Date
type: DatatypeProperty
range: Literal
type: NamedIndividual
issued: 2000-07-11
Date Modified: 2008-01-14
comment: Date (often a range) that the resource became or will become available.
Has Version: available-003

Bibliographic Citation
type: AnnotationProperty
sub property of: Identifier
type: DatatypeProperty
domain: Bibliographic Resource
range: Literal
type: NamedIndividual
issued: 2003-02-15
Date Modified: 2008-01-14
comment: A bibliographic reference for the resource.
description: Recommended practice is to include sufficient bibliographic detail to identify the resource as unambiguously as possible.
Has Version: bibliographicCitation-002

Conforms To
type: AnnotationProperty
sub property of: Relation
type: ObjectProperty
range: Standard
type: NamedIndividual
issued: 2001-05-21
Date Modified: 2008-01-14
comment: An established standard to which the described resource conforms.
Has Version: conformsTo-003

Contributor
type: AnnotationProperty
sub property of: Contributor
type: ObjectProperty
range: Agent
type: NamedIndividual
issued: 2008-01-14
Date Modified: 2010-10-11
comment: An entity responsible for making contributions to the resource.
description: Examples of a Contributor include a person, an organization, or a service.
Has Version: contributorT-001

Coverage
type: AnnotationProperty
sub property of: Coverage
type: ObjectProperty
range: Location, Period, or Jurisdiction
type: NamedIndividual
Date Modified: 2008-01-14
issued: 2008-01-14
description: Spatial topic and spatial applicability may be a named place or a location specified by its geographic coordinates. Temporal topic may be a named period, date, or date range. A jurisdiction may be a named administrative entity or a geographic place to which the resource applies. Recommended best practice is to use a controlled vocabulary such as the Thesaurus of Geographic Names [TGN]. Where appropriate, named places or time periods can be used in preference to numeric identifiers such as sets of coordinates or date ranges.
comment: The spatial or temporal topic of the resource, the spatial applicability of the resource, or the jurisdiction under which the resource is relevant.
Has Version: coverageT-001

Date Created
type: AnnotationProperty
sub property of: Date
type: DatatypeProperty
range: Literal
type: NamedIndividual
issued: 2000-07-11
Date Modified: 2008-01-14
comment: Date of creation of the resource.
Has Version: created-003

Creator
type: AnnotationProperty
sub property of: Creator
type: ObjectProperty
range: Agent
sub property of: Contributor
type: NamedIndividual
issued: 2008-01-14
Date Modified: 2010-10-11
comment: An entity primarily responsible for making the resource.
description: Examples of a Creator include a person, an organization, or a service.
Has Version: creatorT-002

Date
type: AnnotationProperty
sub property of: Date
type: DatatypeProperty
range: Literal
type: NamedIndividual
issued: 2008-01-14
Date Modified: 2008-01-14
comment: A point or period of time associated with an event in the lifecycle of the resource.
description: Date may be used to express temporal information at any level of granularity. Recommended best practice is to use an encoding scheme, such as the W3CDTF profile of ISO 8601 [W3CDTF].
Has Version: dateT-001

Date Accepted
type: AnnotationProperty
sub property of: Date
type: DatatypeProperty
range: Literal
type: NamedIndividual
issued: 2002-07-13
Date Modified: 2008-01-14
comment: Date of acceptance of the resource.
description: Examples of resources to which a Date Accepted may be relevant are a thesis (accepted by a university department) or an article (accepted by a journal).
Has Version: dateAccepted-002

Date Copyrighted
type: AnnotationProperty
sub property of: Date
type: DatatypeProperty
range: Literal
type: NamedIndividual
issued: 2002-07-13
Date Modified: 2008-01-14
comment: Date of copyright.
Has Version: dateCopyrighted-002

Date Submitted
type: AnnotationProperty
sub property of: Date
type: DatatypeProperty
range: Literal
type: NamedIndividual
issued: 2002-07-13
Date Modified: 2008-01-14
comment: Date of submission of the resource.
description: Examples of resources to which a Date Submitted may be relevant are a thesis (submitted to a university department) or an article (submitted to a journal).
Has Version: dateSubmitted-002

Description
sub property of: Description
type: NamedIndividual
issued: 2008-01-14
Date Modified: 2008-01-14
comment: An account of the resource.
description: Description may include but is not limited to: an abstract, a table of contents, a graphical representation, or a free-text account of the resource.
Has Version: descriptionT-001

Extent
sub property of: Format
type: ObjectProperty
range: Size or Duration
type: NamedIndividual
issued: 2000-07-11
Date Modified: 2008-01-14
comment: The size or duration of the resource.
Has Version: extent-003

Format
type: AnnotationProperty
sub property of: Format
range: Media Type or Extent
type: NamedIndividual
issued: 2008-01-14
Date Modified: 2008-01-14
description: Examples of dimensions include size and duration. Recommended best practice is to use a controlled vocabulary such as the list of Internet Media Types [MIME].
comment: The file format, physical medium, or dimensions of the resource.
Has Version: formatT-001

Has Format
type: AnnotationProperty
sub property of: Relation
type: NamedIndividual
issued: 2000-07-11
Date Modified: 2008-01-14
comment: A related resource that is substantially the same as the pre-existing described resource, but in another format.
note: This term is intended to be used with non-literal values as defined in the DCMI Abstract Model (http://dublincore.org/documents/abstract-model/). As of December 2007, the DCMI Usage Board is seeking a way to express this intention with a formal range declaration.
Has Version: hasFormat-003

Has Part
type: AnnotationProperty
sub property of: Relation
type: NamedIndividual
issued: 2000-07-11
Date Modified: 2008-01-14
comment: A related resource that is included either physically or logically in the described resource.
note: This term is intended to be used with non-literal values as defined in the DCMI Abstract Model (http://dublincore.org/documents/abstract-model/). As of December 2007, the DCMI Usage Board is seeking a way to express this intention with a formal range declaration.
Has Version: hasPart-003

Has Version
sub property of: Relation
type: NamedIndividual
issued: 2000-07-11
Date Modified: 2008-01-14
comment: A related resource that is a version, edition, or adaptation of the described resource.
note: This term is intended to be used with non-literal values as defined in the DCMI Abstract Model (http://dublincore.org/documents/abstract-model/). As of December 2007, the DCMI Usage Board is seeking a way to express this intention with a formal range declaration.
Has Version: hasVersion-003

Identifier
type: AnnotationProperty
sub property of: Identifier
type: DatatypeProperty
range: Literal
type: NamedIndividual
issued: 2008-01-14
Date Modified: 2008-01-14
comment: An unambiguous reference to the resource within a given context.
description: Recommended best practice is to identify the resource by means of a string conforming to a formal identification system.
Has Version: identifierT-001

Has Version
type: AnnotationProperty
sub property of: Relation
type: NamedIndividual
Type: Property
issued: 2002-04-18
Date Modified: 2009-02-02
comment: A related resource of which the described resource is a performance, production, derivation, translation or interpretation.

Is Version Of
type: AnnotationProperty
sub property of: Relation
type: NamedIndividual
Type: Property
Date Modified: 2009-02-02
issued: 2002-04-18
comment: A related resource that is a performance, production, derivation, translation or interpretation of the described resource.

Is Format Of
type: AnnotationProperty
sub property of: Relation
type: NamedIndividual
issued: 2000-07-11
Date Modified: 2008-01-14
comment: A related resource that is substantially the same as the described resource, but in another format.
note: This term is intended to be used with non-literal values as defined in the DCMI Abstract Model (http://dublincore.org/documents/abstract-model/). As of December 2007, the DCMI Usage Board is seeking a way to express this intention with a formal range declaration.
Has Version: isFormatOf-003

Is Part Of
type: AnnotationProperty
sub property of: Relation
type: NamedIndividual
issued: 2000-07-11
Date Modified: 2008-01-14
comment: A related resource in which the described resource is physically or logically included.
note: This term is intended to be used with non-literal values as defined in the DCMI Abstract Model (http://dublincore.org/documents/abstract-model/). As of December 2007, the DCMI Usage Board is seeking a way to express this intention with a formal range declaration.
Has Version: isPartOf-003

Is Referenced By
type: AnnotationProperty
sub property of: Relation
type: NamedIndividual
issued: 2000-07-11
Date Modified: 2008-01-14
comment: A related resource that references, cites, or otherwise points to the described resource.
note: This term is intended to be used with non-literal values as defined in the DCMI Abstract Model (http://dublincore.org/documents/abstract-model/). As of December 2007, the DCMI Usage Board is seeking a way to express this intention with a formal range declaration.
Has Version: isReferencedBy-003

Is Replaced By
type: AnnotationProperty
sub property of: Relation
type: NamedIndividual
issued: 2000-07-11
Date Modified: 2008-01-14
comment: A related resource that supplants, displaces, or supersedes the described resource.
note: This term is intended to be used with non-literal values as defined in the DCMI Abstract Model (http://dublincore.org/documents/abstract-model/). As of December 2007, the DCMI Usage Board is seeking a way to express this intention with a formal range declaration.
Has Version: isReplacedBy-003

Is Required By
type: AnnotationProperty
sub property of: Relation
type: NamedIndividual
issued: 2000-07-11
Date Modified: 2008-01-14
comment: A related resource that requires the described resource to support its function, delivery, or coherence.
note: This term is intended to be used with non-literal values as defined in the DCMI Abstract Model (http://dublincore.org/documents/abstract-model/). As of December 2007, the DCMI Usage Board is seeking a way to express this intention with a formal range declaration.
Has Version: isRequiredBy-003

Is Version Of
type: AnnotationProperty
sub property of: Relation
type: NamedIndividual
issued: 2000-07-11
Date Modified: 2008-01-14
comment: A related resource of which the described resource is a version, edition, or adaptation.
description: Changes in version imply substantive changes in content rather than differences in format.
note: This term is intended to be used with non-literal values as defined in the DCMI Abstract Model (http://dublincore.org/documents/abstract-model/). As of December 2007, the DCMI Usage Board is seeking a way to express this intention with a formal range declaration.
Has Version: isVersionOf-003

Date Issued
sub property of: Date
type: DatatypeProperty
range: Literal
type: NamedIndividual
issued: 2000-07-11
Date Modified: 2008-01-14
comment: Date of formal issuance (e.g., publication) of the resource.
Has Version: issued-003

Language
type: AnnotationProperty
sub property of: Language
type: ObjectProperty
range: Linguistic System
type: NamedIndividual
issued: 2008-01-14
Date Modified: 2008-01-14
comment: A language of the resource.
description: Recommended best practice is to use a controlled vocabulary such as RFC 4646 [RFC4646].
Has Version: languageT-001

License
type: AnnotationProperty
sub property of: Rights
type: ObjectProperty
range: License Document
type: NamedIndividual
issued: 2004-06-14
Date Modified: 2008-01-14
comment: A legal document giving official permission to do something with the resource.
Has Version: license-002

Medium
type: AnnotationProperty
sub property of: Format
type: ObjectProperty
range: Physical Medium
domain: Physical Resource
type: NamedIndividual
issued: 2000-07-11
Date Modified: 2008-01-14
comment: The material or physical carrier of the resource.
Has Version: medium-003

Date Modified
sub property of: Date
type: DatatypeProperty
range: Literal
type: NamedIndividual
issued: 2000-07-11
Date Modified: 2008-01-14
comment: Date on which the resource was changed.
Has Version: modified-003

Publisher
sub property of: Publisher
type: ObjectProperty
range: Agent
type: NamedIndividual
issued: 2008-01-14
Date Modified: 2010-10-11
comment: An entity responsible for making the resource available.
description: Examples of a Publisher include a person, an organization, or a service.
Has Version: publisherT-001

References
type: AnnotationProperty
sub property of: Relation
type: NamedIndividual
issued: 2000-07-11
Date Modified: 2008-01-14
comment: A related resource that is referenced, cited, or otherwise pointed to by the described resource.
note: This term is intended to be used with non-literal values as defined in the DCMI Abstract Model (http://dublincore.org/documents/abstract-model/). As of December 2007, the DCMI Usage Board is seeking a way to express this intention with a formal range declaration.
Has Version: references-003

Relation
type: AnnotationProperty
sub property of: Relation
type: NamedIndividual
Date Modified: 2008-01-14
issued: 2008-01-14
comment: A related resource.
description: Recommended best practice is to identify the related resource by means of a string conforming to a formal identification system.
note: This term is intended to be used with non-literal values as defined in the DCMI Abstract Model (http://dublincore.org/documents/abstract-model/). As of December 2007, the DCMI Usage Board is seeking a way to express this intention with a formal range declaration.
Has Version: relationT-001

Replaces
type: AnnotationProperty
sub property of: Relation
type: NamedIndividual
issued: 2000-07-11
Date Modified: 2008-01-14
comment: A related resource that is supplanted, displaced, or superseded by the described resource.
note: This term is intended to be used with non-literal values as defined in the DCMI Abstract Model (http://dublincore.org/documents/abstract-model/). As of December 2007, the DCMI Usage Board is seeking a way to express this intention with a formal range declaration.
Has Version: replaces-003

Requires
type: AnnotationProperty
sub property of: Relation
type: NamedIndividual
issued: 2000-07-11
Date Modified: 2008-01-14
comment: A related resource that is required by the described resource to support its function, delivery, or coherence.
note: This term is intended to be used with non-literal values as defined in the DCMI Abstract Model (http://dublincore.org/documents/abstract-model/). As of December 2007, the DCMI Usage Board is seeking a way to express this intention with a formal range declaration.
Has Version: requires-003

Rights
type: AnnotationProperty
sub property of: Rights
type: ObjectProperty
range: Rights Statement
type: NamedIndividual
issued: 2008-01-14
Date Modified: 2008-01-14
comment: Information about rights held in and over the resource.
description: Typically, rights information includes a statement about various property rights associated with the resource, including intellectual property rights.
Has Version: rightsT-001

Source
type: AnnotationProperty
sub property of: Source
sub property of: Relation
type: NamedIndividual
Date Modified: 2008-01-14
issued: 2008-01-14
comment: A related resource from which the described resource is derived.
description: The described resource may be derived from the related resource in whole or in part. Recommended best practice is to identify the related resource by means of a string conforming to a formal identification system.
note: This term is intended to be used with non-literal values as defined in the DCMI Abstract Model (http://dublincore.org/documents/abstract-model/). As of December 2007, the DCMI Usage Board is seeking a way to express this intention with a formal range declaration.
Has Version: sourceT-001

Spatial Coverage
type: AnnotationProperty
sub property of: Coverage
type: ObjectProperty
range: Location
type: NamedIndividual
issued: 2000-07-11
Date Modified: 2008-01-14
comment: Spatial characteristics of the resource.
Has Version: spatial-003

Subject
type: AnnotationProperty
sub property of: Subject
type: NamedIndividual
issued: 2008-01-14
Date Modified: 2012-06-14
comment: The topic of the resource.
note: This term is intended to be used with non-literal values as defined in the DCMI Abstract Model (http://dublincore.org/documents/abstract-model/). As of December 2007, the DCMI Usage Board is seeking a way to express this intention with a formal range declaration.
description: Typically, the subject will be represented using keywords, key phrases, or classification codes. Recommended best practice is to use a controlled vocabulary.
Has Version: subjectT-002

Table Of Contents
type: AnnotationProperty
sub property of: Description
type: NamedIndividual
issued: 2000-07-11
Date Modified: 2008-01-14
comment: A list of subunits of the resource.
Has Version: tableOfContents-003

Temporal Coverage
type: AnnotationProperty
sub property of: Coverage
type: ObjectProperty
range: Period of Time
type: NamedIndividual
issued: 2000-07-11
Date Modified: 2008-01-14
comment: Temporal characteristics of the resource.
Has Version: temporal-003

Title
sub property of: Title
type: DatatypeProperty
range: Literal
type: NamedIndividual
issued: 2008-01-14
Date Modified: 2010-10-11
comment: A name given to the resource.
Has Version: titleT-002

Type
type: AnnotationProperty
sub property of: Type
type: ObjectProperty
range: Class
type: NamedIndividual
Date Modified: 2008-01-14
issued: 2008-01-14
description: Recommended best practice is to use a controlled vocabulary such as the DCMI Type Vocabulary [DCMITYPE]. To describe the file format, physical medium, or dimensions of the resource, use the Format element.
comment: The nature or genre of the resource.
Has Version: typeT-001

Date Valid
type: AnnotationProperty
sub property of: Date
type: DatatypeProperty
range: Literal
type: NamedIndividual
issued: 2000-07-11
Date Modified: 2008-01-14
comment: Date (often a range) of validity of a resource.
Has Version: valid-003

publisher
type: AnnotationProperty
type: ObjectProperty
sub property of: Publisher
comment: A Publisher plays the Role of uploading the Dataset to data.gov.au.

Act
type: AnnotationProperty
issued: 2002-04-18
Date Modified: 2009-02-02
comment: A specific piece of legislation which requires or drives the creation or provision of the resource.
sub property of: mandate
sub property of: Mandate
Type: Property

Aggregation Level
type: AnnotationProperty
sub property of: Type
domain: Collection
type: ObjectProperty
Date Modified: 2007-12-19
issued: 2002-04-18
comment: The level of aggregation of the described resource.
description: There are only two values possible for this refinement, either item or collection.
Type: Property

Availability
type: AnnotationProperty
issued: 2007-12-19
Date Modified: 2009-02-02
comment: How the resource can be obtained or accessed, or contact information.
sub property of: availability
Type: Property

Case
type: AnnotationProperty
Date Modified: 2009-02-02
issued: 2002-04-18
comment: A specific piece of case law which requires or drives the creation or provision of the resource.
sub property of: mandate
sub property of: Mandate
Type: Property

Category
type: AnnotationProperty
sub property of: Type
type: ObjectProperty
Date Modified: 2009-02-02
issued: 2002-04-18
comment: The generic type of the resource being described.
description: There are only three valid values for this property, 'service', 'document' or 'agency'.
Type: Property

Date Licensed
type: AnnotationProperty
sub property of: Date
type: DatatypeProperty
range: Literal
Date Modified: 2009-02-02
issued: 2007-12-12
comment: Date a license was applied or became effective.
Type: Property

Document Type
type: AnnotationProperty
sub property of: Type
type: ObjectProperty
issued: 2002-04-18
Date Modified: 2007-12-19
description: Document is used in its widest sense and includes such things as software, sound files and images.
comment: The form of the resource where category = 'document'.
Type: Property

Function
type: AnnotationProperty
Date Modified: 2007-12-19
issued: 2007-12-19
comment: The business function to which the resource relates.
sub property of: function
Type: Property

Jurisdiction
type: AnnotationProperty
sub property of: Coverage
type: ObjectProperty
domain: Jurisdiction
Date Modified: 2007-12-19
issued: 2002-04-18
description: Jurisdiction is a description of the territory over which a particular government exercises its authority or a particular business transacts its operations, to which the resource content is applicable.
comment: The name of the political/administrative entity covered by the resource.
Type: Property

Mandate
type: AnnotationProperty
issued: 2007-12-19
Date Modified: 2009-02-02
comment: A specific legal instrument which requires a resource to be created or made available.
sub property of: mandate
Type: Property

Protective Marking
type: AnnotationProperty
sub property of: Rights
type: ObjectProperty
Date Modified: 2009-02-06
issued: 2007-12-12
comment: A protective marking applied to the resource.
Type: Property

Regulation
type: AnnotationProperty
issued: 2002-04-18
Date Modified: 2009-02-02
comment: A specific regulation which requires or drives the creation or provision of the resource.
sub property of: mandate
sub property of: Mandate
Type: Property

Service Type
type: AnnotationProperty
sub property of: Type
type: ObjectProperty
Date Modified: 2007-12-19
issued: 2002-04-18
comment: The form of the resource where category = 'service'.
Type: Property

DCMI Box
type: Datatype
type: NamedIndividual
issued: 2000-07-11
Date Modified: 2008-01-14
comment: The set of regions in space defined by their geographic coordinates according to the DCMI Box Encoding Scheme.
Has Version: Box-003

ISO 3166
type: Datatype
type: NamedIndividual
issued: 2000-07-11
Date Modified: 2008-01-14
comment: The set of codes listed in ISO 3166-1 for the representation of names of countries.
Has Version: ISO3166-004

ISO 639-2
type: Datatype
type: NamedIndividual
issued: 2000-07-11
Date Modified: 2008-01-14
comment: The three-letter alphabetic codes listed in ISO639-2 for the representation of names of languages.
Has Version: ISO639-2-003

ISO 639-3
type: Datatype
type: NamedIndividual
issued: 2008-01-14
comment: The set of three-letter codes listed in ISO 639-3 for the representation of names of languages.
Has Version: ISO639-3-001

DCMI Period
type: Datatype
type: NamedIndividual
issued: 2000-07-11
Date Modified: 2008-01-14
comment: The set of time intervals defined by their limits according to the DCMI Period Encoding Scheme.
Has Version: Period-003

DCMI Point
type: Datatype
type: NamedIndividual
issued: 2000-07-11
Date Modified: 2008-01-14
comment: The set of points in space defined by their geographic coordinates according to the DCMI Point Encoding Scheme.
Has Version: Point-003

RFC 1766
type: Datatype
type: NamedIndividual
issued: 2000-07-11
Date Modified: 2008-01-14
comment: The set of tags, constructed according to RFC 1766, for the identification of languages.
Has Version: RFC1766-003

RFC 3066
type: Datatype
type: NamedIndividual
issued: 2002-07-13
Date Modified: 2008-01-14
description: RFC 3066 has been obsoleted by RFC 4646.
comment: The set of tags constructed according to RFC 3066 for the identification of languages.
Has Version: RFC3066-002

RFC 4646
type: Datatype
type: NamedIndividual
issued: 2008-01-14
description: RFC 4646 obsoletes RFC 3066.
comment: The set of tags constructed according to RFC 4646 for the identification of languages.
Has Version: RFC4646-001

RFC 5646
type: Datatype
type: NamedIndividual
issued: 2010-10-11
description: RFC 5646 obsoletes RFC 4646.
comment: The set of tags constructed according to RFC 5646 for the identification of languages.
Has Version: RFC5646-001

URI
type: Datatype
type: NamedIndividual
issued: 2000-07-11
Date Modified: 2008-01-14
comment: The set of identifiers constructed according to the generic syntax for Uniform Resource Identifiers as specified by the Internet Engineering Task Force.
Has Version: URI-003

W3C-DTF
type: Datatype
type: NamedIndividual
issued: 2000-07-11
Date Modified: 2008-01-14
comment: The set of dates and times constructed according to the W3C Date and Time Formats Specification.
Has Version: W3CDTF-003

Australian and New Zealand Standard Classification of Occupations
type: Datatype
Date Modified: 2009-02-02
issued: 2002-04-18
comment: The set of occupations specified by the Australian Bureau of Statistics.

AAGLS Agent Scheme
type: Datatype
issued: 2002-04-18
Date Modified: 2009-02-02
comment: The set of agents defined by contact details according to Dublin Core Structured Values

AGLS Availability Scheme
type: Datatype
issued: 2002-04-18
Date Modified: 2009-02-02
comment: The set of resource availability or physical access to a resource defined by contact details according to Dublin Core Structured Values

Government Online Directory
type: Datatype
Date Modified: 2009-02-02
issued: 2002-04-18
comment: The set of agents defined by contact details according to X500 syntax.

Geocode
type: Datatype
Date Modified: 2010-04-13
issued: 2008-10-21
comment: Geographic coordinates expressed as latitude and longitude.

Accrual Method
type: ObjectProperty
domain: Collection
range: Method of Accrual
type: NamedIndividual
issued: 2005-06-13
Date Modified: 2010-10-11
comment: The method by which items are added to a collection.
Has Version: accrualMethod-003

Accrual Periodicity
type: ObjectProperty
domain: Collection
range: Frequency
type: NamedIndividual
issued: 2005-06-13
Date Modified: 2010-10-11
comment: The frequency with which items are added to a collection.
Has Version: accrualPeriodicity-003

Accrual Policy
type: ObjectProperty
domain: Collection
range: Policy
type: NamedIndividual
issued: 2005-06-13
Date Modified: 2010-10-11
comment: The policy governing the addition of items to a collection.
Has Version: accrualPolicy-003

Audience
type: ObjectProperty
range: Agent Class
type: NamedIndividual
issued: 2001-05-21
Date Modified: 2008-01-14
comment: A class of entity for whom the resource is intended or useful.
Has Version: audience-003

Audience Education Level
type: ObjectProperty
range: Agent Class
sub property of: Audience
type: NamedIndividual
issued: 2002-07-13
Date Modified: 2008-01-14
comment: A class of entity, defined in terms of progression through an educational or training context, for which the described resource is intended.
Has Version: educationLevel-002

Instructional Method
type: ObjectProperty
range: Method of Instruction
type: NamedIndividual
issued: 2005-06-13
Date Modified: 2008-01-14
comment: A process, used to engender knowledge, attitudes and skills, that the described resource is designed to support.
description: Instructional Method will typically include ways of presenting instructional materials or conducting instructional activities, patterns of learner-to-learner and learner-to-instructor interactions, and mechanisms by which group and individual levels of learning are measured. Instructional methods include all aspects of the instruction and learning processes from planning and implementation through evaluation and feedback.
Has Version: instructionalMethod-002

Mediator
type: ObjectProperty
range: Agent Class
sub property of: Audience
type: NamedIndividual
issued: 2001-05-21
Date Modified: 2008-01-14
comment: An entity that mediates access to the resource and for whom the resource is intended or useful.
description: In an educational context, a mediator might be a parent, teacher, teaching assistant, or care-giver.
Has Version: mediator-003

Provenance
type: ObjectProperty
range: Provenance Statement
type: NamedIndividual
issued: 2004-09-20
Date Modified: 2008-01-14
comment: A statement of any changes in ownership and custody of the resource since its creation that are significant for its authenticity, integrity, and interpretation.
description: The statement may include a description of any changes successive custodians made to the resource.
Has Version: provenance-002

Rights Holder
type: ObjectProperty
range: Agent
type: NamedIndividual
issued: 2004-06-14
Date Modified: 2008-01-14
comment: A person or organization owning or managing rights over the resource.
Has Version: rightsHolder-002

AGIFT Theme
type: ObjectProperty
comment: The AGIFT classification for this dataset
range: Function
sub property of: classifiedAs

classifiedAs
type: ObjectProperty
comment: A relation to define the main category of the dataset. A dataset can have multiple themes.
range: Classifier
domain: Dataset
sub property of: theme

hasAgent
type: ObjectProperty
comment: Defines a relationship for the Agent responsible for a DatasetChangeEvent through an Association that defines the Organisation that the Agent is associated with for that Event.
range: Agent
sub property of: agent

hasContact
type: ObjectProperty
comment: Defines an agent who is the contact for inquiries on a Dataset.
equivalent property: contactPoint

hasDataset
type: ObjectProperty
comment: Defines a Dataset to be part of a Catalog.
equivalent property: dataset

hasDistribution
type: ObjectProperty
comment: Defines the available distribution(s) for a Dataset.
domain: Dataset
range: Distribution
sub property of: distribution

hasDownloadURL
type: ObjectProperty
comment: Defines the URLs that contains the Distribution of the Dataset in a given format.
equivalent property: downloadURL

hasLandingPage
type: ObjectProperty
comment: Defines a relation that associates a Catalog, Dataset or Distribution with its (one) main Web page that can be navigated to in a Web browser to gain access to the dataset, its distributions and/or additional information.
sub property of: landingPage
range: Document

hasLevelOfGovernment
type: ObjectProperty
comment: Defines a relation that denotes the Level of Government of an Organisation, typically a Government Agency.
range: Level of Government
domain: Organisation

hasLicense
type: ObjectProperty
comment: A relation that associates a Catalog, Dataset or Distribution to its license document under which it is made available.
sub property of: License

hasLocalGovernmentArea
type: ObjectProperty
comment: Defines a relation that denotes the Local Government representing a Locality (a Spatial Thing).
range: Local Government
domain: Locality

hasSpatialExtent
type: ObjectProperty
comment: Spatial extent corresponds to the geographic area within which all items in the dataset fall.
range: Spatial Thing
domain: Class
  union of: Dataset
  union of: Locality

hasTemporalExtent
type: ObjectProperty
comment: Temporal extent corresponds to the time interval within which all items in the dataset occur.
domain: Dataset
range: Time Interval

hasUpdateFrequency
type: ObjectProperty
comment: Describes the anticipated frequency of updates of a Dataset.

inState
type: ObjectProperty
comment: Defines the State or Territory a Locality is located in.
domain: Locality
range: State and Territories Government

isAssociatedWith
type: ObjectProperty
comment: Defines an association between a Dataset Change Event (e.g. Publishing) and an Association that defines the Agent and/or the Organisation responsible for that Change Event.
domain: Dataset Change Event
inverse of: participatesIn
range: Association
sub property of: qualifiedAssociation

isChangedBy
type: ObjectProperty
comment: Defines a relation that relates a Dataset Change Event to a Dataset. Typically, at least, a Publishing Change Event should be defined that describes when a Dataset is published on the Web.
domain: Dataset
range: Dataset Change Event
inverse of: resultedIn
sub property of: wasInfluencedBy

isDescribedBy
type: ObjectProperty
comment: Defines a relation that associates a Thing to a Dataset that describes the Dataset in more detail.
domain: Dataset
range: Thing
sub property of: isPrimaryTopicOf

isMemberOf
type: ObjectProperty
comment: Defines a relation that denotes the beloning of an Agent to an Organisation.
range: Organisation
domain: Agent

maintenanceArrangement
type: ObjectProperty
comment: Links to a description of a maintenance activity.
domain: Dataset
range: Dataset Maintenance Arrangement
sub property of: wasInfluencedBy

playsRole
type: ObjectProperty
comment: A relation that defines the Role someone plays in a Dataset Change event defined through an Association entity.
range: Role
domain: Association
sub property of: hadRole

downloadURL
comment: Defines a relation between a Dataset and the URL that contains the distribution of the dataset in a given format.

Change Event Date
type: DatatypeProperty
comment: The date a change was made.
sub property of: Date Accepted
range: dateTime

Update Date
type: DatatypeProperty
comment: A relation to define when the Dataset was updated, i.e. a minor change that is not reflected in a Dataset Change Event.
sub property of: Change Event Date
range: dateTime

File Size
type: DatatypeProperty
comment: The size of a distribution in bytes.
equivalent property: byteSize

hasPurpose
type: DatatypeProperty
comment: The purpose of a Dataset.
domain: Dataset
range: Literal

Keyword
type: DatatypeProperty
comment: A keyword associated with the Dataset.
equivalent property: keyword

Agent
type: Class
type: Agent Class
type: NamedIndividual
issued: 2008-01-14
comment: A resource that acts or has the power to act.
description: Examples of Agent include person, organization, and software agent.
Has Version: Agent-001

Agent Class
type: Class
subclass of: Class
type: NamedIndividual
issued: 2008-01-14
Date Modified: 2012-06-14
comment: A group of agents.
description: Examples of Agent Class include groups seen as classes, such as students, women, charities, lecturers.
Has Version: AgentClass-003

Bibliographic Resource
type: Class
type: NamedIndividual
issued: 2008-01-14
comment: A book, article, or other documentary resource.
Has Version: BibliographicResource-001

File Format
type: Class
subclass of: Media Type
type: NamedIndividual
issued: 2008-01-14
comment: A digital resource format.
description: Examples include the formats defined by the list of Internet Media Types.
Has Version: FileFormat-001

Frequency
type: Class
type: NamedIndividual
issued: 2008-01-14
comment: A rate at which something recurs.
Has Version: Frequency-001

Jurisdiction
type: Class
subclass of: Location, Period, or Jurisdiction
type: NamedIndividual
issued: 2008-01-14
comment: The extent or range of judicial, law enforcement, or other authority.
Has Version: Jurisdiction-001

License Document
type: Class
subclass of: Rights Statement
type: NamedIndividual
issued: 2008-01-14
comment: A legal document giving official permission to do something with a Resource.
Has Version: LicenseDocument-001

Linguistic System
type: Class
type: NamedIndividual
issued: 2008-01-14
comment: A system of signs, symbols, sounds, gestures, or rules used in communication.
description: Examples include written, spoken, sign, and computer languages.
Has Version: LinguisticSystem-001

Location
type: Class
subclass of: Location, Period, or Jurisdiction
type: NamedIndividual
issued: 2008-01-14
comment: A spatial region or named place.
Has Version: Location-001

Location, Period, or Jurisdiction
type: Class
type: NamedIndividual
issued: 2008-01-14
comment: A location, period of time, or jurisdiction.
Has Version: LocationPeriodOrJurisdiction-001

Media Type
type: Class
subclass of: Media Type or Extent
type: NamedIndividual
issued: 2008-01-14
comment: A file format or physical medium.
Has Version: MediaType-001

Media Type or Extent
type: Class
type: NamedIndividual
issued: 2008-01-14
comment: A media type or extent.
Has Version: MediaTypeOrExtent-001

Method of Accrual
type: Class
type: NamedIndividual
issued: 2008-01-14
comment: A method by which resources are added to a collection.
Has Version: MethodOfAccrual-001

Method of Instruction
type: Class
type: NamedIndividual
issued: 2008-01-14
comment: A process that is used to engender knowledge, attitudes, and skills.
Has Version: MethodOfInstruction-001

Period of Time
type: Class
subclass of: Location, Period, or Jurisdiction
type: NamedIndividual
issued: 2008-01-14
comment: An interval of time that is named or defined by its start and end dates.
Has Version: PeriodOfTime-001

Physical Medium
type: Class
subclass of: Media Type
type: NamedIndividual
issued: 2008-01-14
comment: A physical material or carrier.
description: Examples include paper, canvas, or DVD.
Has Version: PhysicalMedium-001

Physical Resource
type: Class
type: NamedIndividual
issued: 2008-01-14
comment: A material thing.
Has Version: PhysicalResource-001

Policy
type: Class
type: NamedIndividual
issued: 2008-01-14
comment: A plan or course of action by an authority, intended to influence and determine decisions, actions, and other matters.
Has Version: Policy-001

Provenance Statement
type: Class
type: NamedIndividual
issued: 2008-01-14
comment: A statement of any changes in ownership and custody of a resource since its creation that are significant for its authenticity, integrity, and interpretation.
Has Version: ProvenanceStatement-001

Rights Statement
type: Class
type: NamedIndividual
issued: 2008-01-14
comment: A statement about the intellectual property rights (IPR) held in or over a Resource, a legal document giving official permission to do something with a resource, or a statement about access rights.
Has Version: RightsStatement-001

Size or Duration
type: Class
subclass of: Media Type or Extent
type: NamedIndividual
issued: 2008-01-14
comment: A dimension or extent, or a time taken to play or execute.
description: Examples include a number of pages, a specification of length, width, and breadth, or a period in hours, minutes, and seconds.
Has Version: SizeOrDuration-001

Standard
type: Class
type: NamedIndividual
issued: 2008-01-14
comment: A basis for comparison; a reference point against which other things can be evaluated.
Has Version: Standard-001

Function
type: Class
subclass of: Classifier
comment: The Government Function defined by the Australian Governments' Interactive Functions Thesaurus that best describes the data contained within a Dataset.
Source: Function Class

AssociatedOrganisation
type: Class
subclass of: Association
comment: An AssociatedOrganisation is an Organisation that is responsible for an Event that changed a Dataset the Organisation is associated with.

Catalog
type: Class
subclass of: Catalog
subclass of: Entity
comment: A Catalog is a curated collection of metadata about datasets.

Classifier
type: Class
subclass of: Concept
comment: A classifier used for Australian Government Data.

Dataset
type: Class
subclass of: Dataset
subclass of: Entity
subclass of: Restriction
  on property: AGIFT Theme
  min cardinality: 1
subclass of: Restriction
  on property: Update Date
  some values from: Literal
subclass of: Restriction
  on property: Change Event Date
  some values from: Literal
subclass of: Restriction
  on property: License
  some values from: License Document
comment: A Dataset is a collection of resources, published or curated by an agent, and openly available for download in one or more formats.

Dataset Change Event
type: Class
subclass of: Activity
comment: A Dataset Change Event is a description of an event that happens at a given point in time and that results in any type of change to the Dataset.

Dataset Publication Event
type: Class
subclass of: Dataset Change Event
comment: A Dataset Publication Event is a description of an event that happens at a given point in time and that results in the publication of a Dataset on data.gov.au.

Distribution
type: Class
subclass of: Distribution
subclass of: Entity
comment: A Distribution defines the available form of a Dataset, i.e. different formats of the Dataset or different type of endpoints the Dataset can be retrieved from.

Document
type: Class
equivalent class: Document
subclass of: Entity

Federal Government
type: Class
subclass of: Level of Government
comment: Federal Government denotes the federal democratic administrative authority of the Commonwealth of Australia.

Field of Research
type: Class
subclass of: Classifier
comment: The Field of Research defined by the Australian and New Zealand Standard Research Classification (ANZSRC) that best describes the type of methods applied to obtain the data contained within a Dataset.

Spatial Gazetteer
type: Class
subclass of: Locality
comment: Locality with a name authorised by a government agency

Government Agency
type: Class
subclass of: Organisation
comment: A Government Agency is a kind of Organisation in the Commonwealth of Australia that is a distinct and recognisable body which has responsibility for carrying out administrative functions.

Level of Government
type: Class
comment: Level of Government is a description that is used to describe the Jurisidiction of an Organisation.

Local Government
type: Class
subclass of: Level of Government
subclass of: Restriction
  on property: inState
  cardinality: 1
comment: Local Government is the lowest tier of government in the Commonwealth of Australia administered under the states and territories.

Locality
type: Class
subclass of: Spatial Thing
comment: Locality is a Spatial Thing corresponding to a place or area, which is denoted by a commonly recognised, or formally designated, name or description.

Dataset Maintenance Arrangement
type: Class
subclass of: Activity
subclass of: Restriction
  on property: wasAssociatedWith
  min cardinality: 1
subclass of: Restriction
  on property: endedAtTime
  min cardinality: 0
subclass of: Restriction
  on property: startedAtTime
  cardinality: 1
comment: Provides information about the maintenance arrangements for the dataset. At a minimum the Agent and start-time for the maintenance responsibility is required.

Organisation
type: Class
subclass of: Agent
subclass of: Organization
comment: An Organisation is a kind of Agent representing, for example, a business or government, or organisational subunits thereof.

Point
type: Class
subclass of: Geometry
comment: This is a stub class which allows us to defer which external vocabulary to adopt. Adoption can be at run-time through a owl:equivalentClass axiom - likely to be from WGS84_pos or OGC GeoSPARQL or both, or something else as proposed by the W3C SDWWG.
comment: A Point is a point in space using its geographic coordinates.

Polygon
type: Class
subclass of: Geometry
comment: This is a stub class which allows us to defer which external vocabulary to adopt. Adoption can be at run-time through a owl:equivalentClass axiom in the data - likely to be from WGS84_pos or OGC GeoSPARQL or both, or something else as proposed by the W3C SDWWG.

Role
type: Class
subclass of: Role
comment: A Role corresponds to the involvement of an Agent in an Event, e.g. fulfilling a publisher, contributor or custodian Role.

Spatial Thing
type: Class
subclass of: SpatialObject
comment: This is a stub class which allows us to defer which external vocabulary to adopt. Adoption can be at run-time through a owl:equivalentClass axiom in the data - likely to be w3 geo or OGC GeoSPARQL or both, or something else as proposed by SDWWG.
comment: A Spatial Thing describes the spatial characteristics of the resources within a Dataset, i.e. the geographical area where data was collected, a place which is the predominant subject of the Dataset, or a location which is the focus of an activity described in the Dataset.

State and Territories Government
type: Class
subclass of: Level of Government
comment: States and Territories Government are the second tier of Government in the Commonwealth of Australia. The Commonwealth of Australia comprises of six states and various territories some of which enjoy a large degree of self-governance.

Time Interval
type: Class
subclass of: Interval
comment: Note that this is a subclass of the Interval class from OWL-Time.
comment: A Time Interval describes a time period (interval) during which data was collected or observations were made that are described in the Dataset.

AGLS Agent Class
type: Class
issued: 2008-05-27
Date Modified: 2010-04-13
comment: A set of agent encoding schemes and/or formats

Availability Class
type: Class
Date Modified: 2009-02-02
issued: 2007-12-12
comment: A set of availability encoding schemes and/or formats

Document Class
type: Class
issued: 2007-12-12
Date Modified: 2009-02-02
comment: A set of document encoding schemes and/or formats

Function Class
type: Class
issued: 2007-12-12
Date Modified: 2010-04-13
comment: A set of function encoding schemes and/or formats

Jurisdiction Class
type: Class
Date Modified: 2009-02-02
issued: 2007-12-12
comment: A set of jurisdiction encoding schemes and/or formats

Service Class
type: Class
Date Modified: 2010-04-13
issued: 2007-12-12
comment: A set of service encoding schemes and/or formats

AGLS Audience Vocabulary
type: Class
issued: 2002-04-18
Date Modified: 2009-02-02
comment: The set of audience types specified by the AGLS Audience Scheme.

DCMI Metadata Terms - other
type: NamedIndividual
Date Modified: 2012-06-14
publisher: DCMI

DCMI Type Vocabulary
type: VocabularyEncodingScheme
type: NamedIndividual
issued: 2000-07-11
Date Modified: 2012-06-14
comment: The set of classes specified by the DCMI Type Vocabulary, used to categorize the nature or genre of the resource.
Has Version: DCMIType-005

DDC
type: VocabularyEncodingScheme
type: NamedIndividual
issued: 2000-07-11
Date Modified: 2008-01-14
comment: The set of conceptual resources specified by the Dewey Decimal Classification.
Has Version: DDC-003

IMT
type: VocabularyEncodingScheme
type: NamedIndividual
issued: 2000-07-11
Date Modified: 2008-01-14
comment: The set of media types specified by the Internet Assigned Numbers Authority.
Has Version: IMT-004

LCC
type: VocabularyEncodingScheme
type: NamedIndividual
issued: 2000-07-11
Date Modified: 2008-01-14
comment: The set of conceptual resources specified by the Library of Congress Classification.
Has Version: LCC-003

LCSH
type: VocabularyEncodingScheme
type: NamedIndividual
issued: 2000-07-11
Date Modified: 2008-01-14
comment: The set of labeled concepts specified by the Library of Congress Subject Headings.
Has Version: LCSH-003

MeSH
type: VocabularyEncodingScheme
type: NamedIndividual
issued: 2000-07-11
Date Modified: 2008-01-14
comment: The set of labeled concepts specified by the Medical Subject Headings.
Has Version: MESH-003

NLM
type: VocabularyEncodingScheme
type: NamedIndividual
issued: 2005-06-13
Date Modified: 2008-01-14
comment: The set of conceptual resources specified by the National Library of Medicine Classification.
Has Version: NLM-002

TGN
type: VocabularyEncodingScheme
type: NamedIndividual
issued: 2000-07-11
Date Modified: 2008-01-14
comment: The set of places specified by the Getty Thesaurus of Geographic Names.
Has Version: TGN-003

UDC
type: VocabularyEncodingScheme
type: NamedIndividual
issued: 2000-07-11
Date Modified: 2008-01-14
comment: The set of conceptual resources specified by the Universal Decimal Classification.
Has Version: UDC-003

The AGLS Metadata Terms Namespace providing access to its content by means of an RDF Schema.
Rights: Copyright Commonwealth of Australia 2007
Date Created: 2002-04-18
language: English
Date Modified: 2010-06-30
publisher: National Archives of Australia
creator: National Archives of Australia
description: The AGLS Metadata Terms Namespace provides URIs for the AGLS Metadata Terms Vocabulary. Vocabulary terms are declared using RDF Schema language to support RDF applications. The AGLS Metadata Terms form a richer vocabulary, which is intended to facilitate discovery of resources. It will be updated according to AGLS Working Group decisions.

Dublin Core Metadata Element Set, Version 1.1
Date Modified: 2012-06-14
publisher: DCMI